BDBM50236954 CHEMBL4084977
SMILES Brc1cccc(c1)C(=O)\C=C\c1cccnc1
InChI Key InChIKey=NTMMNDZZHPICBG-VOTSOKGWSA-N
Data  7 IC50
  Tab Delimited (TSV)   2D SDfile   Computed 3D by Vconf -m prep SDfile
Find this compound or compounds like it in BindingDB:
Activity Spreadsheet -- Enzyme Inhibition Constant Data from BindingDB
Found 1 hit for monomerid = 50236954
TargetCytochrome P450 2C9(Homo sapiens (Human))
De Montfort University
Curated by ChEMBL
LigandPNGBDBM50236954(CHEMBL4084977)
Affinity DataIC50: >2.00E+4nM. Assay description: Inhibition of human liver CYP2C9 expressed in Saccharomyces cerevisiae YY7 microsomal membranes using DBF as substrate after 10 mins by fluorescence ...
In DepthDetails ArticlePubMed